Target
NAD-dependent protein deacylase sirtuin-5, mitochondrial
Ligand
BDBM50255714
Substrate
Meas. Tech.
ChEBML_1687482
IC50
19±n/a nM
Citation
 Kalbas, DLiebscher, SNowak, TMeleshin, MPannek, MPopp, CAlhalabi, ZBordusa, FSippl, WSteegborn, CSchutkowski, M Potent and Selective Inhibitors of Human Sirtuin 5. J Med Chem 61:2460-2471 (2018)  
Target
Name:
NAD-dependent protein deacylase sirtuin-5, mitochondrial
Synonyms:
NAD-dependent protein deacetylase sirtuin-5 (SIRT5) Regulatory protein SIR2 homolog 5 SIR2L5 SIRT5
Type:
Protein
Mol. Mass.:
33892.62
Organism:
Homo sapiens (Human)
Description:
Q9NXA8
Residue:
310
  
Inhibitor
Name:
BDBM50255714
Synonyms:
CHEMBL4064460
Type:
Small organic molecule
Emp. Form.:
C78H116N14O21S2
Mol. Mass.:
1649.967
SMILES:
[H][C@]12CS[C@@H](CCCCC(=O)NCCCOCCOCCOCCCNC(=O)CCC(=O)NCC(=O)N[C@@H](C(C)C)C(=O)N[C@@H](CC(C)C)C(=O)N[C@@H](CCCCNC(=O)C[C@H](Sc3ccc4ccccc4c3)C(O)=O)C(=O)N[C@@H](CCC(O)=O)C(=O)N[C@@H](Cc3ccc(O)cc3)C(=O)NCC(=O)N[C@@H](C(C)C)C(N)=O)[C@@]1([H])NC(=O)N2
: