Target
Carbonic anhydrase 2
Ligand
BDBM50256757
Substrate
Meas. Tech.
ChEBML_1688180
Ki
9.1±n/a nM
Citation
 Mohamed, MAAbdel-Aziz, AASakr, HMEl-Azab, ASBua, SSupuran, CT Synthesis and human/bacterial carbonic anhydrase inhibition with a series of sulfonamides incorporating phthalimido moieties. Bioorg Med Chem 25:2524-2529 (2017)  
Target
Name:
Carbonic anhydrase 2
Synonyms:
CA-II CAC Carbonate dehydratase II Carbonic anhydrase 2 (CA-II) Carbonic anhydrase C Carbonic anhydrase II (CA-II) Carbonic anhydrase II (hCA II) | Carbonic anhydrase isoenzyme II (hCA II)
Type:
Enzyme
Mol. Mass.:
29250.71
Organism:
Homo sapiens (Human)
Description:
P00918
Residue:
260
  
Inhibitor
Name:
BDBM50256757
Synonyms:
CHEMBL4063781
Type:
Small organic molecule
Emp. Form.:
C23H17N3O7S
Mol. Mass.:
479.462
SMILES:
Cc1ccc(NC(=O)c2ccc3C(=O)N(C(=O)c3c2)c2ccc(cc2)S(N)(=O)=O)c(c1)C(O)=O
: