Target
Carbonic anhydrase 1
Ligand
BDBM50256770
Substrate
Meas. Tech.
ChEBML_1688179
Ki
91±n/a nM
Citation
 Mohamed, MAAbdel-Aziz, AASakr, HMEl-Azab, ASBua, SSupuran, CT Synthesis and human/bacterial carbonic anhydrase inhibition with a series of sulfonamides incorporating phthalimido moieties. Bioorg Med Chem 25:2524-2529 (2017)  
Target
Name:
Carbonic anhydrase 1
Synonyms:
CA-I CAB Carbonate dehydratase I Carbonic anhydrase 1 (CA I) Carbonic anhydrase 1 (Recombinant CA I) Carbonic anhydrase B Carbonic anhydrase I (CA I) Carbonic anhydrase I (CAI) Carbonic anhydrase isoenzyme I (hCA I) | hCA
Type:
Enzyme
Mol. Mass.:
28873.37
Organism:
Homo sapiens (Human)
Description:
P00915
Residue:
261
  
Inhibitor
Name:
BDBM50256770
Synonyms:
CHEMBL4067935
Type:
Small organic molecule
Emp. Form.:
C26H23N3O9S
Mol. Mass.:
553.541
SMILES:
COc1cc(NC(=O)c2ccc3C(=O)N(CCc4ccc(cc4)S(N)(=O)=O)C(=O)c3c2)c(cc1OC)C(O)=O
: