Target
Carbonic anhydrase 2
Ligand
BDBM50256769
Substrate
Meas. Tech.
ChEBML_1688180
Ki
8.4±n/a nM
Citation
 Mohamed, MAAbdel-Aziz, AASakr, HMEl-Azab, ASBua, SSupuran, CT Synthesis and human/bacterial carbonic anhydrase inhibition with a series of sulfonamides incorporating phthalimido moieties. Bioorg Med Chem 25:2524-2529 (2017)  
Target
Name:
Carbonic anhydrase 2
Synonyms:
CA-II CAC Carbonate dehydratase II Carbonic anhydrase 2 (CA-II) Carbonic anhydrase C Carbonic anhydrase II (CA-II) Carbonic anhydrase II (hCA II) | Carbonic anhydrase isoenzyme II (hCA II)
Type:
Enzyme
Mol. Mass.:
29250.71
Organism:
Homo sapiens (Human)
Description:
P00918
Residue:
260
  
Inhibitor
Name:
BDBM50256769
Synonyms:
CHEMBL4094824
Type:
Small organic molecule
Emp. Form.:
C24H18IN3O7S
Mol. Mass.:
619.385
SMILES:
NS(=O)(=O)c1ccc(CCN2C(=O)c3ccc(cc3C2=O)C(=O)Nc2ccc(I)cc2C(O)=O)cc1
: