Target
Carbonic anhydrase 1
Ligand
BDBM50256789
Substrate
Meas. Tech.
ChEBML_1688179
Ki
8.7±n/a nM
Citation
 Mohamed, MAAbdel-Aziz, AASakr, HMEl-Azab, ASBua, SSupuran, CT Synthesis and human/bacterial carbonic anhydrase inhibition with a series of sulfonamides incorporating phthalimido moieties. Bioorg Med Chem 25:2524-2529 (2017)  
Target
Name:
Carbonic anhydrase 1
Synonyms:
CA-I CAB Carbonate dehydratase I Carbonic anhydrase 1 (CA I) Carbonic anhydrase 1 (Recombinant CA I) Carbonic anhydrase B Carbonic anhydrase I (CA I) Carbonic anhydrase I (CAI) Carbonic anhydrase isoenzyme I (hCA I) | hCA
Type:
Enzyme
Mol. Mass.:
28873.37
Organism:
Homo sapiens (Human)
Description:
P00915
Residue:
261
  
Inhibitor
Name:
BDBM50256789
Synonyms:
CHEMBL4082361
Type:
Small organic molecule
Emp. Form.:
C22H14IN3O7S
Mol. Mass.:
591.332
SMILES:
NS(=O)(=O)c1ccc(cc1)N1C(=O)c2ccc(cc2C1=O)C(=O)Nc1ccc(I)cc1C(O)=O
: