Target
Lysine-specific histone demethylase 1A
Ligand
BDBM50256941
Substrate
Meas. Tech.
ChEBML_1688544
IC50
8200±n/a nM
Citation
 Borrello, MTSchinor, BBartels, KBenelkebir, HPereira, SAl-Jamal, WTDouglas, LDuriez, PJPackham, GHaufe, GGanesan, A Fluorinated tranylcypromine analogues as inhibitors of lysine-specific demethylase 1 (LSD1, KDM1A). Bioorg Med Chem Lett 27:2099-2101 (2017)  
Target
Name:
Lysine-specific histone demethylase 1A
Synonyms:
AOF2 Flavin-containing amine oxidase domain-containing protein 2 KDM1A KIAA0601 Lysine-specific demethylase 1 (LSD1) Lysine-specific histone demethylase 1 (LSD1)
Type:
Enzyme
Mol. Mass.:
92901.01
Organism:
Homo sapiens (Human)
Description:
O60341
Residue:
852
  
Inhibitor
Name:
BDBM50256941
Synonyms:
CHEMBL4079589
Type:
Small organic molecule
Emp. Form.:
C10H9F4N
Mol. Mass.:
219.1788
SMILES:
N[C@H]1C[C@]1(F)c1cccc(c1)C(F)(F)F
: