Target
Lysine-specific histone demethylase 1A
Ligand
BDBM50261924
Substrate
Meas. Tech.
ChEMBL_1688544 (CHEMBL4039114)
IC50
>25000±n/a nM
Citation
 Borrello, MTSchinor, BBartels, KBenelkebir, HPereira, SAl-Jamal, WTDouglas, LDuriez, PJPackham, GHaufe, GGanesan, A Fluorinated tranylcypromine analogues as inhibitors of lysine-specific demethylase 1 (LSD1, KDM1A). Bioorg Med Chem Lett 27:2099-2101 (2017)  
Target
Name:
Lysine-specific histone demethylase 1A
Synonyms:
AOF2 Flavin-containing amine oxidase domain-containing protein 2 KDM1A KIAA0601 Lysine-specific demethylase 1 (LSD1) Lysine-specific histone demethylase 1 (LSD1)
Type:
Enzyme
Mol. Mass.:
92901.01
Organism:
Homo sapiens (Human)
Description:
O60341
Residue:
852
  
Inhibitor
Name:
BDBM50261924
Synonyms:
CHEMBL462630 | trans-2-Fluoro-2-(4-methoxyphenyl)cyclopropylamine
Type:
Small organic molecule
Emp. Form.:
C10H12FNO
Mol. Mass.:
181.2068
SMILES:
COc1ccc(cc1)[C@@]1(F)C[C@@H]1N
: