Target
Myeloperoxidase
Ligand
BDBM50008381
Substrate
Meas. Tech.
ChEBML_140816
EC50
60000±n/a nM
Citation
 Or, YSClark, RFLane, BMollison, KWCarter, GWLuly, JR Improvements in the minimum binding sequence of C5a: examination of His-67. J Med Chem 35:402-6 (1992)  
Target
Name:
Myeloperoxidase
Synonyms:
84 kDa myeloperoxidase MPO Myeloperoxidase Myeloperoxidase heavy chain PERM_HUMAN
Type:
Enzyme
Mol. Mass.:
83888.32
Organism:
Homo sapiens (Human)
Description:
P05164
Residue:
745
  
Inhibitor
Name:
BDBM50008381
Synonyms:
CHEMBL441393 Ile-Ser-Phe-Lys-Asp-Met-Gln-Leu-Gly-Arg
Type:
Small organic molecule
Emp. Form.:
C52H87N15O15S
Mol. Mass.:
1194.404
SMILES:
CC[C@H](C)[C@H](N)C(=O)N[C@@H](CO)C(=O)N[C@@H](Cc1ccccc1)C(=O)N[C@@H](CCCCN)C(=O)N[C@@H](CC(O)=O)C(=O)N[C@@H](CCSC)C(=O)N[C@@H](CCC(N)=O)C(=O)N[C@@H](CC(C)C)C(=O)NCC(=O)N[C@@H](CCCNC(N)=N)C(O)=O
: