Target
Gastrin/cholecystokinin type B receptor
Ligand
BDBM50008653
Substrate
Meas. Tech.
ChEBML_47978
IC50
6300±n/a nM
Citation
 Kerwin, JFWagenaar, FKopecka, HLin, CWMiller, TWitte, DStashko, MNadzan, AM Cholecystokinin antagonists: (R)-tryptophan-based hybrid antagonists of high affinity and selectivity for CCK-A receptors. J Med Chem 34:3350-9 (1992)  
Target
Name:
Gastrin/cholecystokinin type B receptor
Synonyms:
CCK-2 receptor CCK-BR CCKRB Cholecystokinin receptor GASR_HUMAN | Gastrin/cholecystokinin type B receptor
Type:
G Protein-Coupled Receptor (GPCR)
Mol. Mass.:
48445.79
Organism:
Homo sapiens (Human)
Description:
Stable expression of human CCK-2 receptors in HEK 293 cells.
Residue:
447
  
Inhibitor
Name:
BDBM50008653
Synonyms:
CHEMBL112612 | Quinoline-3-carboxylic acid [2-(5-benzyloxy-1H-indol-3-yl)-1-dipentylcarbamoyl-ethyl]-amide
Type:
Small organic molecule
Emp. Form.:
C38H44N4O3
Mol. Mass.:
604.781
SMILES:
CCCCCN(CCCCC)C(=O)C(Cc1c[nH]c2ccc(OCc3ccccc3)cc12)NC(=O)c1cnc2ccccc2c1
: