Target
Cholecystokinin receptor type A
Ligand
BDBM50008653
Substrate
Meas. Tech.
ChEBML_49718
IC50
67±n/a nM
Citation
 Kerwin, JFWagenaar, FKopecka, HLin, CWMiller, TWitte, DStashko, MNadzan, AM Cholecystokinin antagonists: (R)-tryptophan-based hybrid antagonists of high affinity and selectivity for CCK-A receptors. J Med Chem 34:3350-9 (1992)  
Target
Name:
Cholecystokinin receptor type A
Synonyms:
CCK-A receptor CCK1-R CCKAR_CAVPO Cholecystokinin receptor type A | Cholecystokinin-1 receptor
Type:
Mol. Mass.:
48229.77
Organism:
Cavia porcellus
Description:
Residue:
430
  
Inhibitor
Name:
BDBM50008653
Synonyms:
CHEMBL112612 | Quinoline-3-carboxylic acid [2-(5-benzyloxy-1H-indol-3-yl)-1-dipentylcarbamoyl-ethyl]-amide
Type:
Small organic molecule
Emp. Form.:
C38H44N4O3
Mol. Mass.:
604.781
SMILES:
CCCCCN(CCCCC)C(=O)C(Cc1c[nH]c2ccc(OCc3ccccc3)cc12)NC(=O)c1cnc2ccccc2c1
: