Target
Sodium channel protein type 5 subunit alpha
Ligand
BDBM50258216
Substrate
Meas. Tech.
ChEBML_1690309
IC50
>30000±n/a nM
Citation
 Martinez Botella, GSalituro, FGHarrison, BLBeresis, RTBai, ZBlanco, MJBelfort, GMDai, JLoya, CMAckley, MAAlthaus, ALGrossman, SJHoffmann, EDoherty, JJRobichaud, AJ Neuroactive Steroids. 2. 3?-Hydroxy-3?-methyl-21-(4-cyano-1H-pyrazol-1'-yl)-19-nor-5?-pregnan-20-one (SAGE-217): A Clinical Next Generation Neuroactive Steroid Positive Allosteric Modulator of the (?-Aminobutyric Acid) J Med Chem 60:7810-7819 (2017)  
Target
Name:
Sodium channel protein type 5 subunit alpha
Synonyms:
HH1 SCN5A_HUMAN Sodium channel protein type 5 subunit alpha/beta-1/beta-2 Voltage-gated sodium channel subunit alpha Nav1.5
Type:
Enzyme
Mol. Mass.:
226908.60
Organism:
Homo sapiens (Human)
Description:
Q14524
Residue:
2016
  
Inhibitor
Name:
BDBM50258216
Synonyms:
CHEMBL4105630
Type:
Small organic molecule
Emp. Form.:
C25H35N3O2
Mol. Mass.:
409.5643
SMILES:
[H][C@@]12CC[C@H](C(=O)Cn3cc(cn3)C#N)[C@@]1(C)CC[C@@]1([H])[C@@]2([H])CC[C@]2([H])C[C@](C)(O)CC[C@]12[H]
: