Target
Cytochrome P450 2B6
Ligand
BDBM50258216
Substrate
Meas. Tech.
ChEBML_1690320
IC50
>30000±n/a nM
Citation
 Martinez Botella, GSalituro, FGHarrison, BLBeresis, RTBai, ZBlanco, MJBelfort, GMDai, JLoya, CMAckley, MAAlthaus, ALGrossman, SJHoffmann, EDoherty, JJRobichaud, AJ Neuroactive Steroids. 2. 3?-Hydroxy-3?-methyl-21-(4-cyano-1H-pyrazol-1'-yl)-19-nor-5?-pregnan-20-one (SAGE-217): A Clinical Next Generation Neuroactive Steroid Positive Allosteric Modulator of the (?-Aminobutyric Acid) J Med Chem 60:7810-7819 (2017)  
Target
Name:
Cytochrome P450 2B6
Synonyms:
CP2B6_HUMAN Cytochrome P450 2B6 (CYP2B6)
Type:
Protein
Mol. Mass.:
56289.75
Organism:
Homo sapiens (Human)
Description:
P20813
Residue:
491
  
Inhibitor
Name:
BDBM50258216
Synonyms:
CHEMBL4105630
Type:
Small organic molecule
Emp. Form.:
C25H35N3O2
Mol. Mass.:
409.5643
SMILES:
[H][C@@]12CC[C@H](C(=O)Cn3cc(cn3)C#N)[C@@]1(C)CC[C@@]1([H])[C@@]2([H])CC[C@]2([H])C[C@](C)(O)CC[C@]12[H]
: