Target
Potassium voltage-gated channel subfamily H member 2
Ligand
BDBM50258216
Substrate
Meas. Tech.
ChEMBL_1690310 (CHEMBL4040880)
IC50
>30000±n/a nM
Citation
 Martinez Botella, GSalituro, FGHarrison, BLBeresis, RTBai, ZBlanco, MJBelfort, GMDai, JLoya, CMAckley, MAAlthaus, ALGrossman, SJHoffmann, EDoherty, JJRobichaud, AJ Neuroactive Steroids. 2. 3?-Hydroxy-3?-methyl-21-(4-cyano-1H-pyrazol-1'-yl)-19-nor-5?-pregnan-20-one (SAGE-217): A Clinical Next Generation Neuroactive Steroid Positive Allosteric Modulator of the (?-Aminobutyric Acid) J Med Chem 60:7810-7819 (2017)  
Target
Name:
Potassium voltage-gated channel subfamily H member 2
Synonyms:
1,3-beta-glucan synthase component GLS2 ERG Eag-related protein 1 Ether-a-go-go-related gene (HERG) Ether-a-go-go-related gene potassium channel 1 Ether-a-go-go-related gene potassium channel 1 (hERG1) Ether-a-go-go-related protein 1 H-ERG KCNH2 Potassium voltage-gated channel subfamily H member 2 (hERG) Voltage-gated potassium channel subunit Kv11.1 hERG Potassium Channel 1 | putative potassium channel subunit
Type:
Multi-pass membrane protein
Mol. Mass.:
126672.65
Organism:
Homo sapiens (Human)
Description:
Q12809
Residue:
1159
  
Inhibitor
Name:
BDBM50258216
Synonyms:
CHEMBL4105630
Type:
Small organic molecule
Emp. Form.:
C25H35N3O2
Mol. Mass.:
409.5643
SMILES:
[H][C@@]12CC[C@H](C(=O)Cn3cc(cn3)C#N)[C@@]1(C)CC[C@@]1([H])[C@@]2([H])CC[C@]2([H])C[C@](C)(O)CC[C@]12[H]
: