Target
Gamma-aminobutyric acid receptor subunit alpha-1/beta-2/gamma-2
Ligand
BDBM50258256
Substrate
Meas. Tech.
ChEMBL_1690284 (CHEMBL4040854)
EC50
125±n/a nM
Citation
 Martinez Botella, GSalituro, FGHarrison, BLBeresis, RTBai, ZBlanco, MJBelfort, GMDai, JLoya, CMAckley, MAAlthaus, ALGrossman, SJHoffmann, EDoherty, JJRobichaud, AJ Neuroactive Steroids. 2. 3?-Hydroxy-3?-methyl-21-(4-cyano-1H-pyrazol-1'-yl)-19-nor-5?-pregnan-20-one (SAGE-217): A Clinical Next Generation Neuroactive Steroid Positive Allosteric Modulator of the (?-Aminobutyric Acid) J Med Chem 60:7810-7819 (2017)  
Target
Name:
Gamma-aminobutyric acid receptor subunit alpha-1/beta-2/gamma-2
Synonyms:
GABA receptor alpha-1/beta-2/gamma-2 subunit | GABA-A receptor; alpha-1/beta-2/gamma-2
Type:
Protein
Mol. Mass.:
Description:
Components:
This complex has 3 components.
Component 1
Name:
Gamma-aminobutyric acid receptor subunit alpha-1
Synonyms:
Benzodiazepine central GABA A Benzodiazepine liver GABA(A) receptor subunit alpha-1 GABA-A receptor GBRA1_HUMAN TBPS | agonist GABA site
Type:
Protein
Mol. Mass.:
51817.35
Organism:
Homo sapiens (Human)
Description:
P14867
Residue:
456
  
Component 2
Name:
Gamma-aminobutyric acid receptor subunit beta-2
Synonyms:
GABA(A) receptor subunit beta-2 GBRB2_HUMAN
Type:
PROTEIN
Mol. Mass.:
59167.91
Organism:
Homo sapiens (Human)
Description:
EBI_221
Residue:
512
  
Component 3
Name:
Gamma-aminobutyric acid receptor subunit gamma-2
Synonyms:
GABA(A) receptor subunit gamma-2 GBRG2_HUMAN
Type:
PROTEIN
Mol. Mass.:
54172.74
Organism:
Homo sapiens (Human)
Description:
EBI_217
Residue:
467
  
Inhibitor
Name:
BDBM50258256
Synonyms:
CHEMBL3427532
Type:
Small organic molecule
Emp. Form.:
C23H35N3O2
Mol. Mass.:
385.5429
SMILES:
[H][C@@]12CC[C@H](C(=O)Cn3nccn3)[C@@]1(C)CC[C@@]1([H])[C@@]2([H])CC[C@]2([H])C[C@](C)(O)CC[C@]12[H]
: