Target
Falcipain 2
Ligand
BDBM50258524
Substrate
Meas. Tech.
ChEBML_1690554
IC50
>50000±n/a nM
Citation
 Previti, SEttari, RCosconati, SAmendola, GChouchene, KWagner, AHellmich, UAUlrich, KKrauth-Siegel, RLWich, PRSchmid, ISchirmeister, TGut, JRosenthal, PJGrasso, SZappalą, M Development of Novel Peptide-Based Michael Acceptors Targeting Rhodesain and Falcipain-2 for the Treatment of Neglected Tropical Diseases (NTDs). J Med Chem 60:6911-6923 (2017)  
Target
Name:
Falcipain 2
Synonyms:
Cysteine protease falcipain-2 Falcipain-2
Type:
Enzyme
Mol. Mass.:
55912.60
Organism:
Plasmodium falciparum
Description:
Recombinant falcipain-2.
Residue:
484
  
Inhibitor
Name:
BDBM50258524
Synonyms:
CHEMBL4081250
Type:
Small organic molecule
Emp. Form.:
C34H33N3O7S
Mol. Mass.:
627.707
SMILES:
[O-][N+](=O)c1ccc(COC(=O)N[C@@H](Cc2ccccc2)C(=O)N[C@@H](CCc2ccccc2)\C=C\S(=O)(=O)c2ccccc2)cc1
: