Target
Procathepsin L
Ligand
BDBM50258524
Substrate
Meas. Tech.
ChEBML_1690549
Ki
45±n/a nM
Citation
 Previti, SEttari, RCosconati, SAmendola, GChouchene, KWagner, AHellmich, UAUlrich, KKrauth-Siegel, RLWich, PRSchmid, ISchirmeister, TGut, JRosenthal, PJGrasso, SZappalą, M Development of Novel Peptide-Based Michael Acceptors Targeting Rhodesain and Falcipain-2 for the Treatment of Neglected Tropical Diseases (NTDs). J Med Chem 60:6911-6923 (2017)  
Target
Name:
Procathepsin L
Synonyms:
CATL1_HUMAN CTSL CTSL1 Cathepsin L Cathepsin L1 heavy chain MEP cathepsin L preproprotein
Type:
Enzyme
Mol. Mass.:
37557.19
Organism:
Homo sapiens (Human)
Description:
Purchased from Calbiochem (San Diego, CA).
Residue:
333
  
Inhibitor
Name:
BDBM50258524
Synonyms:
CHEMBL4081250
Type:
Small organic molecule
Emp. Form.:
C34H33N3O7S
Mol. Mass.:
627.707
SMILES:
[O-][N+](=O)c1ccc(COC(=O)N[C@@H](Cc2ccccc2)C(=O)N[C@@H](CCc2ccccc2)\C=C\S(=O)(=O)c2ccccc2)cc1
: