Target
Mu-type opioid receptor
Ligand
BDBM50452995
Substrate
Meas. Tech.
ChEMBL_146259 (CHEMBL757483)
Ki
2160±n/a nM
Citation
 Vecchietti, VGiordani, AGiardina, GColle, RClarke, GD (2S)-1-(arylacetyl)-2-(aminomethyl)piperidine derivatives: novel, highly selective kappa opioid analgesics. J Med Chem 34:397-403 (1991)  
Target
Name:
Mu-type opioid receptor
Synonyms:
M-OR-1 Mu opioid receptor OPIATE Mu OPRM_CAVPO
Type:
Enzyme Catalytic Domain
Mol. Mass.:
11165.58
Organism:
GUINEA PIG
Description:
P97266
Residue:
98
  
Inhibitor
Name:
BDBM50452995
Synonyms:
CHEMBL2111856
Type:
Small organic molecule
Emp. Form.:
C16H22Cl2N2O
Mol. Mass.:
329.265
SMILES:
CN(C)C[C@@H]1CCCCN1C(=O)Cc1ccc(Cl)c(Cl)c1
: