Target
Adenosine receptor A2a
Ligand
BDBM50306696
Substrate
Meas. Tech.
ChEBML_1691304
Ki
4300±n/a nM
Citation
 van der Walt, MMTerre'Blanche, G Selected C8 two-chain linkers enhance the adenosine A Eur J Med Chem 125:652-656 (2017)  
Target
Name:
Adenosine receptor A2a
Synonyms:
AA2AR_RAT Adenosine A2 receptor Adenosine Receptors A2a (A2a) Adenosine receptors A2a Rat striatal adenosine A2a receptor
Type:
G Protein-Coupled Receptor (GPCR)
Mol. Mass.:
45015.65
Organism:
Rattus norvegicus (rat)
Description:
Rat A2A receptors expressed in CHO cells.
Residue:
410
  
Inhibitor
Name:
BDBM50306696
Synonyms:
8-Benzyloxycaffeine cid_223566
Type:
Small organic molecule
Emp. Form.:
C15H16N4O3
Mol. Mass.:
300.3125
SMILES:
Cn1c(OCc2ccccc2)nc2n(C)c(=O)n(C)c(=O)c12
: