Target
Plasminogen
Ligand
BDBM50260048
Substrate
Meas. Tech.
ChEMBL_1692438 (CHEMBL4043328)
Kd
700±n/a nM
Citation
 Afosah, DKAl-Horani, RASankaranarayanan, NVDesai, UR Potent, Selective, Allosteric Inhibition of Human Plasmin by Sulfated Non-Saccharide Glycosaminoglycan Mimetics. J Med Chem 60:641-657 (2017)  
Target
Name:
Plasminogen
Synonyms:
Activation peptide PLG Plasmin Plasmin heavy chain A, short form | Plasmin light chain B
Type:
Enzyme
Mol. Mass.:
90579.18
Organism:
Homo sapiens (Human)
Description:
Residue:
810
  
Inhibitor
Name:
BDBM50260048
Synonyms:
CHEMBL4084933
Type:
Small organic molecule
Emp. Form.:
C38H18Na8O38S8
Mol. Mass.:
1522.965
SMILES:
[Na+].[Na+].[Na+].[Na+].[Na+].[Na+].[Na+].[Na+].[O-]S(=O)(=O)Oc1cc(OCc2ccc(COc3cc(OS([O-])(=O)=O)cc4oc(-c5ccc(OS([O-])(=O)=O)c(OS([O-])(=O)=O)c5)c(OS([O-])(=O)=O)c(=O)c34)cc2)c2c(c1)oc(-c1ccc(OS([O-])(=O)=O)c(OS([O-])(=O)=O)c1)c(OS([O-])(=O)=O)c2=O
: