Target
Renin
Ligand
BDBM50009898
Substrate
Meas. Tech.
ChEBML_192728
IC50
350±n/a nM
Citation
 Doherty, AMKaltenbronn, JSHudspeth, JPRepine, JTRoark, WHSircar, ITinney, FJConnolly, CJHodges, JCTaylor, MD New inhibitors of human renin that contain novel replacements at the P2 site. J Med Chem 34:1258-71 (1991)  
Target
Name:
Renin
Synonyms:
Angiotensinogenase RENI_HUMAN
Type:
Enzyme
Mol. Mass.:
45058.99
Organism:
Homo sapiens (Human)
Description:
Residue:
406
  
Inhibitor
Name:
BDBM50009898
Synonyms:
1N-[4-[2-(2-aminoethyl)-1,4-oxazinan-4-yl]-2-hydroxy-1-isobutyl-4-oxo-(1R,2S)-butyl]-6-imino(cyano)(methylsulfanyl)methylamino-2-[1-(1-naphthylmethyl)-3-(1,4-oxazinan-4-yl)-3-oxopropylcarboxamido]hexanamide | CHEMBL417282
Type:
Small organic molecule
Emp. Form.:
C42H62N8O7S
Mol. Mass.:
823.056
SMILES:
CSC(NCCCCC(NC(=O)C(CC(=O)N1CCOCC1)Cc1cccc2ccccc12)C(=O)NC(CC(C)C)[C@@H](O)CC(=O)N1CCOC(CCN)C1)=NC#N
: