Target
Cathepsin D
Ligand
BDBM50009913
Substrate
Meas. Tech.
ChEBML_45146
IC50
81000±n/a nM
Citation
 Doherty, AMKaltenbronn, JSHudspeth, JPRepine, JTRoark, WHSircar, ITinney, FJConnolly, CJHodges, JCTaylor, MD New inhibitors of human renin that contain novel replacements at the P2 site. J Med Chem 34:1258-71 (1991)  
Target
Name:
Cathepsin D
Synonyms:
CATD_BOVIN | CTSD
Type:
PROTEIN
Mol. Mass.:
42158.92
Organism:
Bos taurus
Description:
ChEMBL_1458606
Residue:
387
  
Inhibitor
Name:
BDBM50009913
Synonyms:
CHEMBL22678 | [5-{4-[2-(2-Amino-ethyl)-morpholin-4-yl]-1-cyclohexylmethyl-2-hydroxy-4-oxo-butylcarbamoyl}-5-(3-naphthalen-1-yl-2-naphthalen-1-ylmethyl-propionylamino)-pent-2-ynyl]-carbamic acid tert-butyl ester
Type:
Small organic molecule
Emp. Form.:
C52H67N5O7
Mol. Mass.:
874.1177
SMILES:
CC(C)(C)OC(=O)NCC#CCC(NC(=O)C(Cc1cccc2ccccc12)Cc1cccc2ccccc12)C(=O)NC(CC1CCCCC1)[C@@H](O)CC(=O)N1CCOC(CCN)C1
: