Target
Carbonic anhydrase 2
Ligand
BDBM50278313
Substrate
Meas. Tech.
ChEBML_1693835
Ki
920000±n/a nM
Citation
 Del Prete, SVullo, DOsman, SMAlOthman, ZDonald, WAWinum, JYSupuran, CTCapasso, C Anion inhibitors of the?-carbonic anhydrase from the pathogenic bacterium responsible of tularemia, Francisella tularensis. Bioorg Med Chem 25:4800-4804 (2017)  
Target
Name:
Carbonic anhydrase 2
Synonyms:
CA-II CAC Carbonate dehydratase II Carbonic anhydrase 2 (CA-II) Carbonic anhydrase C Carbonic anhydrase II (CA-II) Carbonic anhydrase II (hCA II) | Carbonic anhydrase isoenzyme II (hCA II)
Type:
Enzyme
Mol. Mass.:
29250.71
Organism:
Homo sapiens (Human)
Description:
P00918
Residue:
260
  
Inhibitor
Name:
BDBM50278313
Synonyms:
CHEMBL471869 | sodium tellurate(VI)
Type:
Small organic molecule
Emp. Form.:
O4Te
Mol. Mass.:
191.6
SMILES:
[O-][Te]([O-])(=O)=O
: