Target
Heat shock 70 kDa protein 1A
Ligand
BDBM50260459
Substrate
Meas. Tech.
ChEBML_1693902
IC50
>100000±n/a nM
Citation
 Tillotson, JKedzior, MGuimarães, LRoss, ABPeters, TLAmbrose, AJSchmidlin, CJZhang, DDCosta-Lotufo, LVRodríguez, ADSchatz, JHChapman, E ATP-competitive, marine derived natural products that target the DEAD box helicase, eIF4A. Bioorg Med Chem Lett 27:4082-4085 (2017)  
Target
Name:
Heat shock 70 kDa protein 1A
Synonyms:
HS71A_HUMAN HSP70.1 HSPA1 HSX70 Heat shock 70 kDa protein 1A/1B | Hsp70
Type:
Chaperone
Mol. Mass.:
70043.82
Organism:
Homo sapiens (Human)
Description:
Residue:
641
  
Inhibitor
Name:
BDBM50260459
Synonyms:
CHEMBL4099907
Type:
Small organic molecule
Emp. Form.:
C15H19BrO
Mol. Mass.:
295.215
SMILES:
C[C@H]1C(=C)CC[C@@]1(C)c1cc(Br)c(C)cc1O
: