Target
Cyclin-K/Cyclin-dependent kinase 9
Ligand
BDBM50263013
Substrate
Meas. Tech.
ChEMBL_1697439 (CHEMBL4048329)
IC50
412±n/a nM
Citation
 Bharate, SBKumar, VJain, SKMintoo, MJGuru, SKNuthakki, VKSharma, MBharate, SSGandhi, SGMondhe, DMBhushan, SVishwakarma, RA Discovery and Preclinical Development of IIIM-290, an Orally Active Potent Cyclin-Dependent Kinase Inhibitor. J Med Chem 61:1664-1687 (2018)  
Target
Name:
Cyclin-K/Cyclin-dependent kinase 9
Synonyms:
CDK9/Cyclin K
Type:
Mol. Mass.:
Description:
ASSAY_ID of ChEMBL is 956649
Components:
This complex has 2 components.
Component 1
Name:
Cyclin-dependent kinase 9
Synonyms:
C-2K CDK9 Cell division cycle 2-like protein kinase 4 Cyclin-Dependent Kinase 9 (CDK9) Serine/threonine-protein kinase PITALRE Tat-associated kinase complex catalytic subunit
Type:
Enzyme Subunit
Mol. Mass.:
42789.13
Organism:
Homo sapiens (Human)
Description:
Residue:
372
  
Component 2
Name:
Cyclin-K
Synonyms:
CCNK CPR4
Type:
PROTEIN
Mol. Mass.:
64254.10
Organism:
Homo sapiens (Human)
Description:
ChEMBL_107901
Residue:
580
  
Inhibitor
Name:
BDBM50263013
Synonyms:
CHEMBL4079206
Type:
Small organic molecule
Emp. Form.:
C23H21Cl2NO5
Mol. Mass.:
462.323
SMILES:
CN1CC[C@@H]([C@H](O)C1)c1c(O)cc(O)c2c1oc(\C=C\c1c(Cl)cccc1Cl)cc2=O
: