Target
Casein kinase II subunit alpha
Ligand
BDBM50335638
Substrate
Meas. Tech.
ChEMBL_1699300 (CHEMBL4050282)
IC50
20±n/a nM
Citation
 Vahter, JViht, KUri, AEnkvist, E Oligo-aspartic acid conjugates with benzo[c][2,6]naphthyridine-8-carboxylic acid scaffold as picomolar inhibitors of CK2. Bioorg Med Chem 25:2277-2284 (2017)  
Target
Name:
Casein kinase II subunit alpha
Synonyms:
CK II CK2- alpha CSK21_HUMAN Casein kinase 2 Casein kinase II alpha/beta Casein kinase II subunit alpha (CK2A1) Casein kinase II subunit alpha (CK2a V66A) Casein kinase II subunit alpha (CK2a)
Type:
Enzyme
Mol. Mass.:
45151.12
Organism:
Homo sapiens (Human)
Description:
P68400
Residue:
391
  
Inhibitor
Name:
BDBM50335638
Synonyms:
5-(3-Chlorophenylamino)benzo[c][2,6]naphthyridine-8-carboxylic acid CHEMBL1230165 US9062043, Table 13, Compound 17 | US9062043, Table 20b, Compound 12
Type:
Small organic molecule
Emp. Form.:
C19H12ClN3O2
Mol. Mass.:
349.77
SMILES:
OC(=O)c1ccc2c(c1)nc(Nc1cccc(Cl)c1)c1ccncc21
: