Target
Albumin
Ligand
BDBM50265392
Substrate
Meas. Tech.
ChEMBL_1699789 (CHEMBL4050771)
IC50
23290±n/a nM
Citation
 Geldenhuys, WJBergeron, SAMullins, JEAljammal, RGaasch, BLChen, WCYun, JHazlehurst, LA High-content screen using zebrafish (Danio rerio) embryos identifies a novel kinase activator and inhibitor. Bioorg Med Chem Lett 27:2029-2037 (2017)  
Target
Name:
Albumin
Synonyms:
ALB Serum albumin | serum albumin precursor
Type:
PROTEIN
Mol. Mass.:
69288.15
Organism:
Bos taurus
Description:
ChEMBL_1502598
Residue:
607
  
Inhibitor
Name:
BDBM50265392
Synonyms:
CHEMBL4088576
Type:
Small organic molecule
Emp. Form.:
C19H15NO4
Mol. Mass.:
321.3267
SMILES:
OC(=O)c1cccc(NC(=O)COc2cccc3ccccc23)c1
: