Target
Tyrosine-protein kinase Lck
Ligand
BDBM50011435
Substrate
Meas. Tech.
ChEBML_210731
IC50
>2000000±n/a nM
Citation
 Cushman, MNagarathnam, DBurg, DLGeahlen, RL Synthesis and protein-tyrosine kinase inhibitory activities of flavonoid analogues. J Med Chem 34:798-806 (1991)  
Target
Name:
Tyrosine-protein kinase Lck
Synonyms:
2.7.10.2 LCK_HUMAN Leukocyte C-terminal Src kinase Lymphocyte-specific protein tyrosine kinase Protein YT16 Proto-oncogene tyrosine-protein kinase LCK T cell-specific protein-tyrosine kinase
Type:
Mol. Mass.:
57987.83
Organism:
Homo sapiens (Human)
Description:
P06239
Residue:
509
  
Inhibitor
Name:
BDBM50011435
Synonyms:
3-(2-Hydroxy-5-methoxy-phenyl)-3-oxo-propionic acid methyl ester | CHEMBL355621
Type:
Small organic molecule
Emp. Form.:
C11H12O5
Mol. Mass.:
224.21
SMILES:
COC(=O)CC(=O)c1cc(OC)ccc1O
: