Target
Sphingosine kinase 2
Ligand
BDBM50266438
Substrate
Meas. Tech.
ChEMBL_1700860 (CHEMBL4051842)
Ki
1300±n/a nM
Citation
 Childress, ESKharel, YBrown, AMBevan, DRLynch, KRSantos, WL Transforming Sphingosine Kinase 1 Inhibitors into Dual and Sphingosine Kinase 2 Selective Inhibitors: Design, Synthesis, and in Vivo Activity. J Med Chem 60:3933-3957 (2017)  
Target
Name:
Sphingosine kinase 2
Synonyms:
SK 2 SPK 2 Sphingosine kinase 2 (SPHK2) | Sphk2
Type:
Enzyme
Mol. Mass.:
65617.92
Organism:
Mus musculus (Mouse)
Description:
Q9JIA7
Residue:
617
  
Inhibitor
Name:
BDBM50266438
Synonyms:
CHEMBL4095315
Type:
Small organic molecule
Emp. Form.:
C25H33N5O
Mol. Mass.:
419.5624
SMILES:
[H][C@]1(CCCN1C(N)=N)c1nc(no1)-c1ccc2cc(CCCCCCCC)ccc2c1
: