Target
Sphingosine kinase 2
Ligand
BDBM50266446
Substrate
Meas. Tech.
ChEMBL_1700850 (CHEMBL4051832)
Ki
900±n/a nM
Citation
 Childress, ESKharel, YBrown, AMBevan, DRLynch, KRSantos, WL Transforming Sphingosine Kinase 1 Inhibitors into Dual and Sphingosine Kinase 2 Selective Inhibitors: Design, Synthesis, and in Vivo Activity. J Med Chem 60:3933-3957 (2017)  
Target
Name:
Sphingosine kinase 2
Synonyms:
SK 2 SPHK2 SPK 2 Sphingosine kinase types 2 (SphK2)
Type:
Protein
Mol. Mass.:
69221.44
Organism:
Homo sapiens (Human)
Description:
Q9NRA0
Residue:
654
  
Inhibitor
Name:
BDBM50266446
Synonyms:
CHEMBL4074878
Type:
Small organic molecule
Emp. Form.:
C22H27N5O3
Mol. Mass.:
409.4815
SMILES:
[H][C@@]1([C@@H](O)CCN1C(N)=N)c1nc(no1)-c1ccc2cc(OCCCCC)ccc2c1
: