Target
Sphingosine kinase 2
Ligand
BDBM50266426
Substrate
Meas. Tech.
ChEMBL_1700850 (CHEMBL4051832)
Ki
90±n/a nM
Citation
 Childress, ESKharel, YBrown, AMBevan, DRLynch, KRSantos, WL Transforming Sphingosine Kinase 1 Inhibitors into Dual and Sphingosine Kinase 2 Selective Inhibitors: Design, Synthesis, and in Vivo Activity. J Med Chem 60:3933-3957 (2017)  
Target
Name:
Sphingosine kinase 2
Synonyms:
SK 2 SPHK2 SPK 2 Sphingosine kinase types 2 (SphK2)
Type:
Protein
Mol. Mass.:
69221.44
Organism:
Homo sapiens (Human)
Description:
Q9NRA0
Residue:
654
  
Inhibitor
Name:
BDBM50266426
Synonyms:
CHEMBL4076808
Type:
Small organic molecule
Emp. Form.:
C24H23ClF3N7OS
Mol. Mass.:
549.999
SMILES:
Cl.[H][C@@]1(Cc2nc(no2)-c2ccc(Nc3nc(cs3)-c3cccc(c3)C(F)(F)F)cc2)CCCN1C(N)=N
: