Target
Epidermal growth factor receptor
Ligand
BDBM50383274
Substrate
Meas. Tech.
ChEMBL_1701500 (CHEMBL4052482)
IC50
1.4±n/a nM
Citation
 Juchum, MGünther, MDöring, ESievers-Engler, ALämmerhofer, MLaufer, S Trisubstituted Imidazoles with a Rigidized Hinge Binding Motif Act As Single Digit nM Inhibitors of Clinically Relevant EGFR L858R/T790M and L858R/T790M/C797S Mutants: An Example of Target Hopping. J Med Chem 60:4636-4656 (2017)  
Target
Name:
Epidermal growth factor receptor
Synonyms:
EGF Receptor Substrate EGFR_HUMAN ERBB1 Epidermal Growth Factor Receptor erbB-1 Epidermal growth factor receptor (EGFR) HER1 Proto-oncogene c-ErbB-1 Tyrosine-Protein Kinase ErbB-1
Type:
Receptor Kinase Domain
Mol. Mass.:
134279.59
Organism:
Homo sapiens (Human)
Description:
P00533
Residue:
1210
  
Inhibitor
Name:
BDBM50383274
Synonyms:
CHEMBL1229592 US9670213, WZ4002
Type:
Small organic molecule
Emp. Form.:
C25H27ClN6O3
Mol. Mass.:
494.973
SMILES:
COc1cc(ccc1Nc1ncc(Cl)c(Oc2cccc(NC(=O)C=C)c2)n1)N1CCN(C)CC1
: