Target
D(3) dopamine receptor
Ligand
BDBM50378015
Substrate
Meas. Tech.
ChEMBL_1701704 (CHEMBL4052937)
Ki
17±n/a nM
Citation
 Michino, MBoateng, CADonthamsetti, PYano, HBakare, OMBonifazi, AEllenberger, MPKeck, TMKumar, VZhu, CVerma, RDeschamps, JRJavitch, JANewman, AHShi, L Toward Understanding the Structural Basis of Partial Agonism at the Dopamine D J Med Chem 60:580-593 (2017)  
Target
Name:
D(3) dopamine receptor
Synonyms:
DOPAMINE D3 DRD3_HUMAN Dopamine D3 receptor (D3) Dopamine receptor Dopamine receptor D3
Type:
Mol. Mass.:
44243.43
Organism:
Homo sapiens (Human)
Description:
Residue:
400
  
Inhibitor
Name:
BDBM50378015
Synonyms:
CHEMBL1627307
Type:
Small organic molecule
Emp. Form.:
C23H26Cl2N4O2
Mol. Mass.:
461.384
SMILES:
O[C@@H](CCNC(=O)c1cc2ccccc2[nH]1)CN1CCN(CC1)c1cccc(Cl)c1Cl
: