Target
Mitogen-activated protein kinase kinase kinase 14
Ligand
BDBM158561
Substrate
Meas. Tech.
ChEMBL_1701709 (CHEMBL4052942)
Ki
41±n/a nM
Citation
 Castanedo, GMBlaquiere, NBeresini, MBravo, BBrightbill, HChen, JCui, HFEigenbrot, CEverett, CFeng, JGodemann, RGogol, EHymowitz, SJohnson, AKayagaki, NKohli, PBKnüppel, KKraemer, JKrüger, SLoke, PMcEwan, PMontalbetti, CRoberts, DASmith, MSteinbacher, SSujatha-Bhaskar, STakahashi, RWang, XWu, LCZhang, YStaben, ST Structure-Based Design of Tricyclic NF-?B Inducing Kinase (NIK) Inhibitors That Have High Selectivity over Phosphoinositide-3-kinase (PI3K). J Med Chem 60:627-640 (2017)  
Target
Name:
Mitogen-activated protein kinase kinase kinase 14
Synonyms:
HsNIK MAP3K14 NF-kappa-beta-inducing kinase (NF-kB) Serine/threonine-protein kinase NIK
Type:
Protein
Mol. Mass.:
104059.50
Organism:
Homo sapiens (Human)
Description:
Q99558
Residue:
947
  
Inhibitor
Name:
BDBM158561
Synonyms:
US9034866, 36
Type:
Small organic molecule
Emp. Form.:
C20H20FN3O3
Mol. Mass.:
369.3895
SMILES:
CC(C)(O)C#Cc1cc2-c3nc(C(N)=O)c(C4CC4)n3CCOc2cc1F
: