Target
Kallikrein-7
Ligand
BDBM50266979
Substrate
Meas. Tech.
ChEMBL_1701752 (CHEMBL4052985)
Ki
69±n/a nM
Citation
 Swedberg, JELi, CYde Veer, SJWang, CKCraik, DJ Design of Potent and Selective Cathepsin G Inhibitors Based on the Sunflower Trypsin Inhibitor-1 Scaffold. J Med Chem 60:658-667 (2017)  
Target
Name:
Kallikrein-7
Synonyms:
KLK7 Kallikrein 7 PRSS6 Serine protease 6 hK7 kallikrein-7 isoform 1 preproprotein
Type:
PROTEIN
Mol. Mass.:
27535.05
Organism:
Homo sapiens (Human)
Description:
ChEMBL_1469257
Residue:
253
  
Inhibitor
Name:
BDBM50266979
Synonyms:
CHEMBL4061897
Type:
Small organic molecule
Emp. Form.:
C70H101N15O17S2
Mol. Mass.:
1488.771
SMILES:
CCCCC1NC(=O)[C@@H]2CSSC[C@H](NC(=O)[C@@H](NC(=O)[C@@H]3CCCN3C(=O)[C@@H]3CCCN3C(=O)[C@@H](NC(=O)[C@H](CO)NC(=O)[C@H](Cc3ccccc3)NC1=O)[C@@H](C)CC)[C@@H](C)CC)C(=O)N[C@@H](Cc1ccccc1)C(=O)N1CCC[C@H]1C(=O)N[C@@H](CC(N)=O)C(=O)NCC(=O)N[C@@H]([C@@H](C)O)C(=O)N2
: