Target
ATPase family AAA domain-containing protein 2B
Ligand
BDBM50249810
Substrate
Meas. Tech.
ChEMBL_1701779 (CHEMBL4053012)
IC50
>100000±n/a nM
Citation
 Igoe, NBayle, EDFedorov, OTallant, CSavitsky, PRogers, COwen, DRDeb, GSomervaille, TCAndrews, DMJones, NCheasty, ARyder, HBrennan, PEMüller, SKnapp, SFish, PV Design of a Biased Potent Small Molecule Inhibitor of the Bromodomain and PHD Finger-Containing (BRPF) Proteins Suitable for Cellular and in Vivo Studies. J Med Chem 60:668-680 (2017)  
Target
Name:
ATPase family AAA domain-containing protein 2B
Synonyms:
ATAD2B ATPase family AAA domain-containing protein 2B | KIAA1240
Type:
PROTEIN
Mol. Mass.:
164918.65
Organism:
Homo sapiens (Human)
Description:
ChEMBL_105350
Residue:
1458
  
Inhibitor
Name:
BDBM50249810
Synonyms:
CHEMBL4102050
Type:
Small organic molecule
Emp. Form.:
C18H15N3O3S
Mol. Mass.:
353.395
SMILES:
Cc1cc2cc(NS(=O)(=O)c3ccc(cc3)C#N)ccc2n(C)c1=O
: