Target
Cytochrome P450 11B2, mitochondrial
Ligand
BDBM50011756
Substrate
Meas. Tech.
ChEMBL_192302 (CHEMBL794467)
IC50
140000±n/a nM
Citation
 Stanek, JAlder, ABellus, DBhatnagar, ASHäusler, ASchieweck, K Synthesis and aromatase inhibitory activity of novel 1-(4-aminophenyl)-3-azabicyclo[3.1.0]hexane- and -[3.1.1]heptane-2,4- diones. J Med Chem 34:1329-34 (1991)  
Target
Name:
Cytochrome P450 11B2, mitochondrial
Synonyms:
Aldosterone synthase CYPXIB2 Cyp11b2 Cytochrome P450 11B2 P450-Aldo-1 | Steroid 11-beta-hydroxylase
Type:
PROTEIN
Mol. Mass.:
58260.64
Organism:
Rattus norvegicus
Description:
ChEMBL_224979
Residue:
510
  
Inhibitor
Name:
BDBM50011756
Synonyms:
1-(4-Amino-phenyl)-3-cyclohexyl-3-aza-bicyclo[3.1.1]heptane-2,4-dione | CHEMBL27467
Type:
Small organic molecule
Emp. Form.:
C18H22N2O2
Mol. Mass.:
298.3795
SMILES:
Nc1ccc(cc1)C12CC(C1)C(=O)N(C1CCCCC1)C2=O
: