Target
Cytochrome P450 11B2, mitochondrial
Ligand
BDBM50011762
Substrate
Meas. Tech.
ChEMBL_192301 (CHEMBL795454)
IC50
>34000±n/a nM
Citation
 Stanek, JAlder, ABellus, DBhatnagar, ASHäusler, ASchieweck, K Synthesis and aromatase inhibitory activity of novel 1-(4-aminophenyl)-3-azabicyclo[3.1.0]hexane- and -[3.1.1]heptane-2,4- diones. J Med Chem 34:1329-34 (1991)  
Target
Name:
Cytochrome P450 11B2, mitochondrial
Synonyms:
Aldosterone synthase CYPXIB2 Cyp11b2 Cytochrome P450 11B2 P450-Aldo-1 | Steroid 11-beta-hydroxylase
Type:
PROTEIN
Mol. Mass.:
58260.64
Organism:
Rattus norvegicus
Description:
ChEMBL_224979
Residue:
510
  
Inhibitor
Name:
BDBM50011762
Synonyms:
(1R,5S)1-(4-Amino-phenyl)-3-cyclohexylmethyl-3-aza-bicyclo[3.1.0]hexane-2,4-dione 1-(4-Amino-phenyl)-3-cyclohexylmethyl-3-aza-bicyclo[3.1.0]hexane-2,4-dione | CHEMBL281947
Type:
Small organic molecule
Emp. Form.:
C18H22N2O2
Mol. Mass.:
298.3795
SMILES:
Nc1ccc(cc1)C12CC1C(=O)N(CC1CCCCC1)C2=O
: