Target
Cytochrome P450 11B2, mitochondrial
Ligand
BDBM9460
Substrate
Meas. Tech.
ChEBML_192302
IC50
110000±n/a nM
Citation
 Stanek, JAlder, ABellus, DBhatnagar, ASHäusler, ASchieweck, K Synthesis and aromatase inhibitory activity of novel 1-(4-aminophenyl)-3-azabicyclo[3.1.0]hexane- and -[3.1.1]heptane-2,4- diones. J Med Chem 34:1329-34 (1991)  
Target
Name:
Cytochrome P450 11B2, mitochondrial
Synonyms:
Aldosterone synthase CYPXIB2 Cyp11b2 Cytochrome P450 11B2 P450-Aldo-1 | Steroid 11-beta-hydroxylase
Type:
PROTEIN
Mol. Mass.:
58260.64
Organism:
Rattus norvegicus
Description:
ChEMBL_224979
Residue:
510
  
Inhibitor
Name:
BDBM9460
Synonyms:
3-(4-aminophenyl)-3-ethyl-piperidine-2,6-dione Aminoglutethimide AG, 4 Cytadren Elipten | aminoglutethimide (AG)
Type:
Small organic molecule
Emp. Form.:
C13H16N2O2
Mol. Mass.:
232.2783
SMILES:
CCC1(CCC(=O)NC1=O)c1ccc(N)cc1
: