Target
Metallo-beta-lactamase GIM-1
Ligand
BDBM50267425
Substrate
Meas. Tech.
ChEMBL_1702771 (CHEMBL4054004)
IC50
>10000±n/a nM
Citation
 Skagseth, SAkhter, SPaulsen, MHMuhammad, ZLauksund, SSamuelsen, ØLeiros, HSBayer, A Metallo-?-lactamase inhibitors by bioisosteric replacement: Preparation, activity and binding. Eur J Med Chem 135:159-173 (2017)  
Target
Name:
Metallo-beta-lactamase GIM-1
Synonyms:
GIM-1 Metallo-beta-lactamase GIM-1
Type:
Enzyme Catalytic Domain
Mol. Mass.:
27418.35
Organism:
Pseudomonas aeruginosa
Description:
Residue:
250
  
Inhibitor
Name:
BDBM50267425
Synonyms:
CHEMBL4105658
Type:
Small organic molecule
Emp. Form.:
C14H23O4P
Mol. Mass.:
286.3038
SMILES:
CCOP(=O)(OCC)C(CO)CCc1ccccc1
: