Target
Platelet-activating factor receptor
Ligand
BDBM50011883
Substrate
Meas. Tech.
ChEBML_154999
IC50
250±n/a nM
Citation
 Walser, AFlynn, TMason, CCrowley, HMaresca, CO'Donnell, M Thienotriazolodiazepines as platelet-activating factor antagonists. Steric limitations for the substituent in position 2. J Med Chem 34:1440-6 (1991)  
Target
Name:
Platelet-activating factor receptor
Synonyms:
PAF Platelet activating factor PAFR PTAFR_HUMAN Platelet-activating factor receptor
Type:
Enzyme Catalytic Domain
Mol. Mass.:
39219.60
Organism:
Homo sapiens (Human)
Description:
PAF Platelet activating factor PTAFR HUMAN::P25105
Residue:
342
  
Inhibitor
Name:
BDBM50011883
Synonyms:
4-(2-Chloro-phenyl)-9-methyl-2-pyridin-2-ylethynyl-6H-1-thia-5,7,8,9a-tetraaza-cyclopenta[e]azulene | CHEMBL285035
Type:
Small organic molecule
Emp. Form.:
C22H14ClN5S
Mol. Mass.:
415.898
SMILES:
Cc1nnc2CN=C(c3cc(sc3-n12)C#Cc1ccccn1)c1ccccc1Cl
: