Target
Type-2 angiotensin II receptor
Ligand
BDBM50011972
Substrate
Meas. Tech.
ChEMBL_36494 (CHEMBL652311)
IC50
0.110000±n/a nM
Citation
 Weinstock, JKeenan, RMSamanen, JHempel, JFinkelstein, JAFranz, RGGaitanopoulos, DEGirard, GRGleason, JGHill, DT 1-(carboxybenzyl)imidazole-5-acrylic acids: potent and selective angiotensin II receptor antagonists. J Med Chem 34:1514-7 (1991)  
Target
Name:
Type-2 angiotensin II receptor
Synonyms:
AGTR2_RAT Agtr2 Angiotensin II receptor Type-2 angiotensin II receptor
Type:
Enzyme Catalytic Domain
Mol. Mass.:
41346.62
Organism:
RAT
Description:
Angiotensin II AT2 0 0::P35351
Residue:
363
  
Inhibitor
Name:
BDBM50011972
Synonyms:
CHEMBL385189 | Sar-Arg-Val-Tyr-Ile-His-Pro-Thi-OH
Type:
Small organic molecule
Emp. Form.:
C47H69N13O10S
Mol. Mass.:
1008.197
SMILES:
CC[C@H](C)[C@H](NC(=O)[C@H](Cc1ccc(O)cc1)NC(=O)[C@@H](NC(=O)[C@H](CCCNC(N)=N)NC(=O)CNC)C(C)C)C(=O)N[C@@H](Cc1cnc[nH]1)C(=O)N1CCC[C@H]1C(=O)N[C@@H](Cc1cccs1)C(O)=O
: