Target
Kappa-type opioid receptor
Ligand
BDBM50269292
Substrate
Meas. Tech.
ChEMBL_1705795 (CHEMBL4057028)
EC50
0.028000±n/a nM
Citation
 Suzuki, SSugawara, YTsuji, RTanimura, RKaneko, CYuzawa, NYagi, MKawai, K Discovery of highly selective?-opioid receptor agonists: 10?-Hydroxy TRK-820 derivatives. Bioorg Med Chem Lett 27:3920-3924 (2017)  
Target
Name:
Kappa-type opioid receptor
Synonyms:
K-OR-1 Kappa-opioid receptor (KOR) Kappa-type opioid receptor (KOR) OPIATE Kappa OPRK1 kappa opioid receptor (KOR)
Type:
G Protein-Coupled Receptor (GPCR)
Mol. Mass.:
42648.76
Organism:
Homo sapiens (Human)
Description:
P41145
Residue:
380
  
Inhibitor
Name:
BDBM50269292
Synonyms:
CHEMBL4066058
Type:
Small organic molecule
Emp. Form.:
C28H32N2O5S
Mol. Mass.:
508.629
SMILES:
[H][C@@]12Oc3c4c(ccc3O)[C@H](O)[C@@]3([H])N(CC5CC5)CC[C@@]14[C@@]3(O)CC[C@H]2N(C)C(=O)\C=C\c1ccsc1
: