Target
Insulin receptor
Ligand
BDBM313081
Substrate
Meas. Tech.
ChEMBL_1706543 (CHEMBL4057776)
EC50
582±n/a nM
Citation
 Goff, DZhang, JHeckrodt, TYu, JDing, PSingh, RHolland, SLi, WIrving, M Discovery of dual Axl/VEGF-R2 inhibitors as potential anti-angiogenic and anti-metastatic drugs for cancer chemotherapy. Bioorg Med Chem Lett 27:3766-3771 (2017)  
Target
Name:
Insulin receptor
Synonyms:
INSR INSR_HUMAN Insulin receptor beta subunit
Type:
Receptor Tyrosine Kinase
Mol. Mass.:
156322.60
Organism:
Homo sapiens (Human)
Description:
P06213
Residue:
1382
  
Inhibitor
Name:
BDBM313081
Synonyms:
1-(2-chloro-7-methylthieno[3,2-d]pyrimidin-4-yl)-N3-(4-(2-(pyrrolidin-1-yl)ethoxy)phenyl)-1H-1,2,4-triazole-3,5-diamine | US10166216, Compound 60
Type:
Small organic molecule
Emp. Form.:
C21H23ClN8OS
Mol. Mass.:
470.978
SMILES:
Cc1csc2c(nc(Cl)nc12)-n1nc(Nc2ccc(OCCN3CCCC3)cc2)nc1N
: