Target
Insulin receptor
Ligand
BDBM313080
Substrate
Meas. Tech.
ChEMBL_1706543 (CHEMBL4057776)
EC50
4170±n/a nM
Citation
 Goff, DZhang, JHeckrodt, TYu, JDing, PSingh, RHolland, SLi, WIrving, M Discovery of dual Axl/VEGF-R2 inhibitors as potential anti-angiogenic and anti-metastatic drugs for cancer chemotherapy. Bioorg Med Chem Lett 27:3766-3771 (2017)  
Target
Name:
Insulin receptor
Synonyms:
INSR INSR_HUMAN Insulin receptor beta subunit
Type:
Receptor Tyrosine Kinase
Mol. Mass.:
156322.60
Organism:
Homo sapiens (Human)
Description:
P06213
Residue:
1382
  
Inhibitor
Name:
BDBM313080
Synonyms:
N3-(3-chloro-4-(2-(pyrrolidin-1-yl)ethoxy)phenyl)-1-(6,7-dimethoxyquinazolin-4-yl)-1H-1,2,4-triazole-3,5-diamine | US10166216, Compound 59
Type:
Small organic molecule
Emp. Form.:
C24H27ClN8O3
Mol. Mass.:
510.976
SMILES:
COc1cc2ncnc(-n3nc(Nc4ccc(OCCN5CCCC5)c(Cl)c4)nc3N)c2cc1OC
: