Target
Polyunsaturated fatty acid 5-lipoxygenase
Ligand
BDBM50012896
Substrate
Meas. Tech.
ChEBML_3961
IC50
24000±n/a nM
Citation
 Flynn, DLCapiris, TCetenko, WJConnor, DTDyer, RDKostlan, CRNies, DESchrier, DJSircar, JC Nonsteroidal antiinflammatory drug hydroxamic acids. Dual inhibitors of both cyclooxygenase and 5-lipoxygenase. J Med Chem 33:2070-2 (1990)  
Target
Name:
Polyunsaturated fatty acid 5-lipoxygenase
Synonyms:
Alox5 LOX5_RAT
Type:
PROTEIN
Mol. Mass.:
78082.31
Organism:
Rattus norvegicus
Description:
ChEMBL_1432947
Residue:
673
  
Inhibitor
Name:
BDBM50012896
Synonyms:
CHEMBL876 MECLOFENAMATE SODIUM Meclomen Sodium; 2-(2,6-dichloro-3-methyl-phenylamino)-benzoate(Fenamate series)
Type:
Small organic molecule
Emp. Form.:
C14H10Cl2NO2
Mol. Mass.:
295.141
SMILES:
Cc1ccc(Cl)c(Nc2ccccc2C([O-])=O)c1Cl
: