Target
Myocilin
Ligand
BDBM50269646
Substrate
Meas. Tech.
ChEMBL_1707014 (CHEMBL4058247)
Kd
300000±n/a nM
Citation
 Srinivasan, BTonddast-Navaei, SSkolnick, J Pocket detection and interaction-weighted ligand-similarity search yields novel high-affinity binders for Myocilin-OLF, a protein implicated in glaucoma. Bioorg Med Chem Lett 27:4133-4139 (2017)  
Target
Name:
Myocilin
Synonyms:
GLC1A MYOC_HUMAN Myocilin 20 kDa N-terminal fragment Myocilin 55 kDa subunit Myocilin, N-terminal fragment Trabecular meshwork-induced glucocorticoid response protein
Type:
PROTEIN
Mol. Mass.:
56965.39
Organism:
Homo sapiens
Description:
ChEMBL_117572
Residue:
504
  
Inhibitor
Name:
BDBM50269646
Synonyms:
CHEMBL1466906
Type:
Small organic molecule
Emp. Form.:
C16H14O6
Mol. Mass.:
302.2788
SMILES:
COc1cc(ccc1O)C(=O)C(=O)c1ccc(O)c(OC)c1
: