Target
Myocilin
Ligand
BDBM50269653
Substrate
Meas. Tech.
ChEMBL_1707014 (CHEMBL4058247)
Kd
650±n/a nM
Citation
 Srinivasan, BTonddast-Navaei, SSkolnick, J Pocket detection and interaction-weighted ligand-similarity search yields novel high-affinity binders for Myocilin-OLF, a protein implicated in glaucoma. Bioorg Med Chem Lett 27:4133-4139 (2017)  
Target
Name:
Myocilin
Synonyms:
GLC1A MYOC_HUMAN Myocilin 20 kDa N-terminal fragment Myocilin 55 kDa subunit Myocilin, N-terminal fragment Trabecular meshwork-induced glucocorticoid response protein
Type:
PROTEIN
Mol. Mass.:
56965.39
Organism:
Homo sapiens
Description:
ChEMBL_117572
Residue:
504
  
Inhibitor
Name:
BDBM50269653
Synonyms:
CHEMBL1432046
Type:
Small organic molecule
Emp. Form.:
C26H20N6O7
Mol. Mass.:
528.473
SMILES:
[O-][N+](=O)c1ccc(NC(=O)Nc2ccc(Oc3ccc(NC(=O)Nc4ccc(cc4)[N+]([O-])=O)cc3)cc2)cc1
: