Target
Cholecystokinin receptor type A
Ligand
BDBM50013195
Substrate
Meas. Tech.
ChEBML_50034
IC50
4800±n/a nM
Citation
 Bock, MGDiPardo, RMEvans, BERittle, KEWhitter, WLVeber, DFFreidinger, RMChang, RSChen, TBLotti, VJ Cholecystokinin-A receptor ligands based on the kappa-opioid agonist tifluadom. J Med Chem 33:450-5 (1990)  
Target
Name:
Cholecystokinin receptor type A
Synonyms:
CCKAR_RAT Cholecystokinin peripheral Cholecystokinin receptor type A
Type:
Enzyme Catalytic Domain
Mol. Mass.:
49676.37
Organism:
RAT
Description:
Cholecystokinin central 0 RAT::P30551
Residue:
444
  
Inhibitor
Name:
BDBM50013195
Synonyms:
CHEMBL140749 | Thiophene-3-carboxylic acid [5-(2-fluoro-phenyl)-1-methyl-2,3,4,5-tetrahydro-1H-benzo[e][1,4]diazepin-2-ylmethyl]-amide
Type:
Small organic molecule
Emp. Form.:
C22H22FN3OS
Mol. Mass.:
395.493
SMILES:
CN1C(CNC(=O)c2ccsc2)CNC(c2ccccc2F)c2ccccc12
: