Target
Matrix metalloproteinase-9
Ligand
BDBM50270510
Substrate
Meas. Tech.
ChEMBL_1709347 (CHEMBL4119396)
Kd
100±n/a nM
Citation
 Yadav, DKBharitkar, YPHazra, APal, UVerma, SJana, SSingh, UPMaiti, NCMondal, NBSwarnakar, S Tamarixetin 3-O-?-d-Glucopyranoside from Azadirachta indica Leaves: Gastroprotective Role through Inhibition of Matrix Metalloproteinase-9 Activity in Mice. J Nat Prod 80:1347-1353 (2017)  
Target
Name:
Matrix metalloproteinase-9
Synonyms:
67 kDa matrix metalloproteinase-9 92 kDa gelatinase CLG4B Gelatinase B MMP9 Matrix metalloproteinase 9 (MMP-9) Matrix metalloproteinase-9 (MMP9)
Type:
Enzyme
Mol. Mass.:
78452.28
Organism:
Homo sapiens (Human)
Description:
P14780
Residue:
707
  
Inhibitor
Name:
BDBM50270510
Synonyms:
CHEMBL3589199
Type:
Small organic molecule
Emp. Form.:
C22H22O12
Mol. Mass.:
478.4029
SMILES:
COc1ccc(cc1O)-c1oc2cc(O)cc(O)c2c(=O)c1O[C@@H]1O[C@H](CO)[C@@H](O)[C@H](O)[C@H]1O
: