Target
Ephrin type-A receptor 7
Ligand
BDBM50271212
Substrate
Meas. Tech.
ChEMBL_1710135 (CHEMBL4120184)
IC50
665±n/a nM
Citation
 Patel, SMeilandt, WJErickson, RIChen, JDeshmukh, GEstrada, AAFuji, RNGibbons, PGustafson, AHarris, SFImperio, JLiu, WLiu, XLiu, YLyssikatos, JPMa, CYin, JLewcock, JWSiu, M Selective Inhibitors of Dual Leucine Zipper Kinase (DLK, MAP3K12) with Activity in a Model of Alzheimer's Disease. J Med Chem 60:8083-8102 (2017)  
Target
Name:
Ephrin type-A receptor 7
Synonyms:
2.7.10.1 EHK3 EPH homology kinase 3 EPHA7 Ephrin receptor Tyrosine Kinase EPHA6 | Tyrosine Kinase EPHA7
Type:
Mol. Mass.:
112085.32
Organism:
Homo sapiens (Human)
Description:
Residue:
998
  
Inhibitor
Name:
BDBM50271212
Synonyms:
CHEMBL3715238
Type:
Small organic molecule
Emp. Form.:
C21H24F3N5O
Mol. Mass.:
419.4434
SMILES:
[H][C@@]12CN(C[C@]1([H])[C@H]2c1cc(nn1CC1CC1)-c1cnc(N)c(c1)C(F)(F)F)C1COC1
: